[Error] java: variable XXXX not initialized in the default constructor
·
Trouble Shooting(Error)
스프링 공부를 하는 중에 애플리케이션 실행이 안되고 아래와 같은 에러 메시지가 발생했다. java: variable myLoggerProvider not initialized in the default constructor 생성자를 직접 코드를 구현하지 않고 @RequiredArgsConsructor 애노테이션을 사용했는데 생성자가 만들어지지 않고 있는 문제였다.해당 문제가 왜 발생하는지 찾아보니 Gradle 5부터는 애노테이션을 구분해서 추가해 주어야 한다고 한다. 내가 문제를 해결하기 전 build.gradle에 추가했던 건 아래와 같다.implementation 'org.projectlombok:lombok' 해당 에러를 해결하기 위해서 build.gradle를 아래와 같이 수정하였다.compile..
[Error] Gradle Compile Error, Gradle BUILD FAILED, Gradle Verification Test Error, Task :compileJava FAILED
·
Trouble Shooting(Error)
IDE는 intelliJ를 사용하고 있고, SpringBoot, Gradle, Java 17로 프로젝트 구성했다.intelliJ Build Tools의 Gradle의 Build And Run은 intelliJ로 설정을 해서 그냥 실행을 시켰을 때는 문제가 발생하지 않았다. Gradle의 verification -> test를 실행하면 문제가 발생했다. 에러 메시지에러 메시지의 일부를 가져와서 붙여 넣어보면 잘되는 것들이 안된다고 하고 찾을 수 없다고 한다.. > Task :compileJava FAILED Deprecated Gradle features were used in this build, making it incompatible with Gradle 9.0. You can use '--warni..
[Error] Kotlin JSON parse error
·
Trouble Shooting(Error)
JSON parse error 발생! 일단 내가 경험했던 에러 메시지는 다음과 같다. JSON으로된 문자열을 Request로 변환해 주어야 하는데 실패 Resolved [org.springframework.http.converter.HttpMessageNotReadableException: JSON parse error: Cannot construct instance of `com.group.libraryapp.dto.book.request.BookRequest` (although at least one Creator exists): cannot deserialize from Object value (no delegate- or property-based Creator); nested exception ..